tcptrace-bugs [Error Compiling : filt_scanner.l:159] + on Debian 3.r01 + tcptrace 6.6.7 like the solaris 10

From: SANTOS Eric (e.santos@teleperformance.fr)
Date: 02/16/05


From: "SANTOS Eric" <e.santos@teleperformance.fr>
Subject: tcptrace-bugs [Error Compiling  : filt_scanner.l:159] + on  Debian 3.r01 + tcptrace 6.6.7  like the solaris 10
Date: Wed, 16 Feb 2005 22:07:26 +0100
Message-Id: <20050216210714.54F921C00091@mwinf1209.wanadoo.fr>


Hello,

I have a problem for compiling tcptrace 6.6.7
My system parameters are :
OS : debian 3 R01
GCC 3.3.4-3
Libc6 2.3.2.ds1-1
Libstdc++5 3.3.4-3
Flex 2.5.31-26
Bison 1.875a-1.1
Make 3.80-8

the display of the error is in the attached file.

For resume :
"./filt_scanner.l: Dans la fonction filtyywrap :
./filt_scanner.l:159: error: `yytext_ptr' undeclared (first use in this
function)
./filt_scanner.l:159: error: (Each undeclared identifier is reported only
once
./filt_scanner.l:159: error: for each function it appears in.)
make: *** [filt_scanner.o] Erreur 1"

I have used too the files in the directory /flex_bison with the command:
cp flex_bison/filt_* .
touch filt_*.{c,h}
but it doesn't work.

Thanks for your job

Eric SANTOS
Administrateur r閟eaux
Teleperformance france
Ben Arous
e.santos@teleperformance.fr
tel : +216 71 389 448
tel : +216 98 438 393
tel fran鏰is : 01 41 58 45 80
N interne : 39532






This archive was generated by hypermail 2.1.7 : 02/17/05 EST